how2j.cn


增值内容,请先登录
完整的 Springboot 模仿天猫项目,使用 Springboot 、Vue.js、shiro、redis、elasticsearch 等一整套技术栈, 从无到有涵盖全部129个知识点,565个开发步骤, 充实 Springboot 项目经验,为简历加上一个有吸引力的砝码.
增值内容,点击购买
使用爬虫已经被系统记录,请勿使用爬虫,增大封号风险。 如果是误封 ,请联系站长,谢谢


HOW2J公众号,关注后实时获知布最新的教程和优惠活动,谢谢。


问答区域    
2019-08-28 项目部署路径
timi8
站长,将项目部署到阿里云后,配置文件中的mysql和redis的地址改用阿里云安全组配置的地址,根本启动不了项目啊 一直报错




1 个答案

how2j 答案时间:2019-08-29
那你现在本地运行,并且配置到 阿里云的 mysql和redis,一步一步地测试呗。 部署本来就是个麻烦事,需要亦步亦趋地慢慢做出来,哪有那么想当然能一蹴而就的呢



回答已经提交成功,正在审核。 请于 我的回答 处查看回答记录,谢谢
答案 或者 代码至少填写一项, 如果是自己有问题,请重新提问,否则站长有可能看不到




2019-03-25 我觉得楼上说的“打包”是将这个springboot项目打包成war包以便放在linux上,我打包的时候报了这个错
塑花kai不落



如题

							
Tests run: 1, Failures: 0, Errors: 1, Skipped: 0, Time elapsed: 0.026 sec <<< FAILURE! - in com.how2java.tmall_springboot.TmallSpringbootApplicationTests
initializationError(com.how2java.tmall_springboot.TmallSpringbootApplicationTests)  Time elapsed: 0.006 sec  <<< ERROR!
java.lang.IllegalStateException: Unable to find a @SpringBootConfiguration, you need to use @ContextConfiguration or @SpringBootTest(classes=...) with your test
	at org.springframework.util.Assert.state(Assert.java:70)
	at org.springframework.boot.test.context.SpringBootTestContextBootstrapper.getOrFindConfigurationClasses(SpringBootTestContextBootstrapper.java:202)
	at org.springframework.boot.test.context.SpringBootTestContextBootstrapper.processMergedContextConfiguration(SpringBootTestContextBootstrapper.java:137)
	at org.springframework.test.context.support.AbstractTestContextBootstrapper.buildMergedContextConfiguration(AbstractTestContextBootstrapper.java:409)
	at org.springframework.test.context.support.AbstractTestContextBootstrapper.buildDefaultMergedContextConfiguration(AbstractTestContextBootstrapper.java:323)
	at org.springframework.test.context.support.AbstractTestContextBootstrapper.buildMergedContextConfiguration(AbstractTestContextBootstrapper.java:277)
	at org.springframework.test.context.support.AbstractTestContextBootstrapper.buildTestContext(AbstractTestContextBootstrapper.java:112)
	at org.springframework.boot.test.context.SpringBootTestContextBootstrapper.buildTestContext(SpringBootTestContextBootstrapper.java:82)
	at org.springframework.test.context.TestContextManager.<init>(TestContextManager.java:120)
	at org.springframework.test.context.TestContextManager.<init>(TestContextManager.java:105)
	at org.springframework.test.context.junit4.SpringJUnit4ClassRunner.createTestContextManager(SpringJUnit4ClassRunner.java:152)
	at org.springframework.test.context.junit4.SpringJUnit4ClassRunner.<init>(SpringJUnit4ClassRunner.java:143)
	at org.springframework.test.context.junit4.SpringRunner.<init>(SpringRunner.java:49)
	at sun.reflect.NativeConstructorAccessorImpl.newInstance0(Native Method)
	at sun.reflect.NativeConstructorAccessorImpl.newInstance(NativeConstructorAccessorImpl.java:62)
	at sun.reflect.DelegatingConstructorAccessorImpl.newInstance(DelegatingConstructorAccessorImpl.java:45)
	at java.lang.reflect.Constructor.newInstance(Constructor.java:422)
	at org.junit.internal.builders.AnnotatedBuilder.buildRunner(AnnotatedBuilder.java:104)
	at org.junit.internal.builders.AnnotatedBuilder.runnerForClass(AnnotatedBuilder.java:86)
	at org.junit.runners.model.RunnerBuilder.safeRunnerForClass(RunnerBuilder.java:59)
	at org.junit.internal.builders.AllDefaultPossibilitiesBuilder.runnerForClass(AllDefaultPossibilitiesBuilder.java:26)
	at org.junit.runners.model.RunnerBuilder.safeRunnerForClass(RunnerBuilder.java:59)
	at org.junit.internal.requests.ClassRequest.getRunner(ClassRequest.java:33)
	at org.apache.maven.surefire.junit4.JUnit4Provider.execute(JUnit4Provider.java:283)
	at org.apache.maven.surefire.junit4.JUnit4Provider.executeWithRerun(JUnit4Provider.java:173)
	at org.apache.maven.surefire.junit4.JUnit4Provider.executeTestSet(JUnit4Provider.java:153)
	at org.apache.maven.surefire.junit4.JUnit4Provider.invoke(JUnit4Provider.java:128)
	at org.apache.maven.surefire.booter.ForkedBooter.invokeProviderInSameClassLoader(ForkedBooter.java:203)
	at org.apache.maven.surefire.booter.ForkedBooter.runSuitesInProcess(ForkedBooter.java:155)
	at org.apache.maven.surefire.booter.ForkedBooter.main(ForkedBooter.java:103)


Results :

Tests in error: 
  TmallSpringbootApplicationTests.initializationError » IllegalState Unable to f...

Tests run: 1, Failures: 0, Errors: 1, Skipped: 0

[INFO] ------------------------------------------------------------------------
[INFO] BUILD FAILURE
[INFO] ------------------------------------------------------------------------
[INFO] Total time: 2.396 s
[INFO] Finished at: 2019-03-25T17:11:47+08:00
[INFO] Final Memory: 16M/39M
[INFO] ------------------------------------------------------------------------
[ERROR] Failed to execute goal org.apache.maven.plugins:maven-surefire-plugin:2.18.1:test (default-test) on project tmall_springboot: There are test failures.
[ERROR] 
[ERROR] Please refer to E:\project\tmall_springboot\target\surefire-reports for the individual test results.
[ERROR] -> [Help 1]
[ERROR] 
[ERROR] To see the full stack trace of the errors, re-run Maven with the -e switch.
[ERROR] Re-run Maven using the -X switch to enable full debug logging.
[ERROR] 
[ERROR] For more information about the errors and possible solutions, please read the following articles:
[ERROR] [Help 1] http://cwiki.apache.org/confluence/display/MAVEN/MojoFailureException

Process finished with exit code 1


2 个答案

how2j 答案时间:2019-03-26
是呀,是依赖于这些中间件的嘛

塑花kai不落 答案时间:2019-03-25
打好包了,要先开启redis服务器,elasticSearch服务器才能打包



回答已经提交成功,正在审核。 请于 我的回答 处查看回答记录,谢谢
答案 或者 代码至少填写一项, 如果是自己有问题,请重新提问,否则站长有可能看不到





2019-03-08 打包步骤




提问之前请登陆
提问已经提交成功,正在审核。 请于 我的提问 处查看提问记录,谢谢
关于 实践项目-天猫整站Springboot-nginx 的提问

尽量提供截图代码异常信息,有助于分析和解决问题。 也可进本站QQ群交流: 881555796
提问尽量提供完整的代码,环境描述,越是有利于问题的重现,您的问题越能更快得到解答。
对教程中代码有疑问,请提供是哪个步骤,哪一行有疑问,这样便于快速定位问题,提高问题得到解答的速度
在已经存在的几千个提问里,有相当大的比例,是因为使用了和站长不同版本的开发环境导致的,比如 jdk, eclpise, idea, mysql,tomcat 等等软件的版本不一致。
请使用和站长一样的版本,可以节约自己大量的学习时间。 站长把教学中用的软件版本整理了,都统一放在了这里, 方便大家下载: http://how2j.cn/k/helloworld/helloworld-version/1718.html

上传截图